Broken dependency selenium-server-standalone

Description

Hello team, i'm having issues materializing the project.

This dependency is broken:
selenium-server-standalone-2.39.0

Error:

{{[INFO] BUILD FAILURE
[INFO] ------------------------------------------------------------------------
[INFO] Total time: 01:48 min
[INFO] Finished at: 2019-08-29T15:38:00-05:00
[INFO] ------------------------------------------------------------------------
[ERROR] Failed to execute goal org.apache.maven.plugins:maven-dependency-plugin:3.1.1:copy (default) on project org.idempiere.fitnesse.server: Unable
to find/resolve artifact.: Failed to read artifact descriptor for org.seleniumhq.selenium:selenium-server-standalone:jar:2.39.0: Could not transfer
artifact org.seleniumhq.selenium:selenium-server-standaloneom:2.39.0 from/to Redhat-GA (https://maven.repository.redhat.com/ga): Failed to transfer
file https://maven.repository.redhat.com/ga/org/seleniumhq/selenium/selenium-server-standalone/2.39.0/selenium-server-standalone-2.39.0.pom with sta
tus code 500 -> [Help 1]
[ERROR]
[ERROR] To see the full stack trace of the errors, re-run Maven with the -e switch.
[ERROR] Re-run Maven using the -X switch to enable full debug logging.
[ERROR]
[ERROR] For more information about the errors and possible solutions, please read the following articles:
[ERROR] [Help 1] http://cwiki.apache.org/confluence/display/MAVEN/MojoExecutionException
[ERROR]
[ERROR] After correcting the problems, you can resume the build with the command
[ERROR] mvn <goals> -rf :org.idempiere.fitnesse.server
}}

Environment

None

Status

Assignee

Unassigned

Reporter

Saúl Piña

Labels

None

Tested By

None

Components

Affects versions

Priority

Blocker
Configure